Reaction Details
TargetSphingosine 1-phosphate receptor 3
LigandBDBM313174
Substrate/Competitorn/a
Meas. Tech.Receptor [35S] GTPgammaS Binding Assays: (S1P1 GTPgammaS/S1P3 GTPgammaS)
EC50>2000±n/a nM
Citation Dyckman, AJDhar, TGXiao, HGilmore, JLYang, MGXiao, ZMarcoux, D Substituted bicyclic compounds US Patent US10166249 Publication Date 1/1/2019
 
Sphingosine 1-phosphate receptor 3
Name:Sphingosine 1-phosphate receptor 3
Type:G Protein-Coupled Receptor (GPCR)
Mol. Mass.:42278.13
Organism:Homo sapiens (Human)
Description:Q99500
Residue:378
BDBM313174
NameBDBM313174
Synonyms:US10166249, Example 689 US11058696, Example 689 | US11701373, Example 689
TypeSmall organic molecule
Emp. Form.C22H36NO5P
Mol. Mass.425.4987
SMILESCOCCCCCC1CCc2cc(ccc2C1)[C@H]1CC[C@](N)(COP(O)(O)=O)C1