Reaction Details
TargetSphingosine-1-phosphate lyase 1
LigandBDBM313194
Substrate/Competitorn/a
Meas. Tech.Receptor [35S] GTPgammaS Binding Assays: (S1P1 GTPgammaS/S1P3 GTPgammaS)
EC50 5500±n/a nM
Citation Dyckman, AJDhar, TGXiao, HGilmore, JLYang, MGXiao, ZMarcoux, D Substituted bicyclic compounds US Patent US10166249 Publication Date 1/1/2019
 
Sphingosine-1-phosphate lyase 1
Name:Sphingosine-1-phosphate lyase 1
Type:PROTEIN
Mol. Mass.:63546.76
Organism:Homo sapiens (Human)
Description:ChEMBL_108363
Residue:568
BDBM313194
NameBDBM313194
Synonyms:US10166249, Example 423 US10166249, Example 425
TypeSmall organic molecule
Emp. Form.C21H34NO5P
Mol. Mass.411.4721
SMILESCCCCCCC1COc2cc(ccc2C1)C1CCC(N)(COP(O)(O)=O)C1