Reaction Details
TargetSphingosine-1-phosphate lyase 1
LigandBDBM65125
Substrate/Competitorn/a
Meas. Tech.Receptor [35S] GTPgammaS Binding Assays: (S1P1 GTPgammaS/S1P3 GTPgammaS)
EC50<10±n/a nM
Citation Dyckman, AJDhar, TGXiao, HGilmore, JLYang, MGXiao, ZMarcoux, D Substituted bicyclic compounds US Patent US10166249 Publication Date 1/1/2019
 
Sphingosine-1-phosphate lyase 1
Name:Sphingosine-1-phosphate lyase 1
Type:PROTEIN
Mol. Mass.:63546.76
Organism:Homo sapiens (Human)
Description:ChEMBL_108363
Residue:568
BDBM65125
NameBDBM65125
Synonyms:US10166249, Example 481 | US9522888, 481
Typen/a
Emp. Form.C25H34NO6P
Mol. Mass.475.5143
SMILESCOc1cccc(COC[C@H]2CCc3cc(ccc3C2)[C@H]2CC[C@](N)(COP(O)(O)=O)C2)c1