Reaction Details
TargetSphingosine 1-phosphate receptor 3
LigandBDBM65126
Substrate/Competitorn/a
Meas. Tech.Receptor [35S] GTPgammaS Binding Assays: (S1P1 GTPgammaS/S1P3 GTPgammaS)
EC50>625±n/a nM
Citation Dyckman, AJDhar, TGXiao, HGilmore, JLYang, MGXiao, ZMarcoux, D Substituted bicyclic compounds US Patent US10166249 Publication Date 1/1/2019
 
Sphingosine 1-phosphate receptor 3
Name:Sphingosine 1-phosphate receptor 3
Type:G Protein-Coupled Receptor (GPCR)
Mol. Mass.:42278.13
Organism:Homo sapiens (Human)
Description:Q99500
Residue:378
BDBM65126
NameBDBM65126
Synonyms:US10166249, Example 482 | US9522888, 482
Typen/a
Emp. Form.C25H34NO6P
Mol. Mass.475.5143
SMILESCOc1ccc(COC[C@@H]2CCc3cc(ccc3C2)[C@H]2CC[C@](N)(COP(O)(O)=O)C2)cc1