Reaction Details
TargetSphingosine-1-phosphate lyase 1
LigandBDBM313254
Substrate/Competitorn/a
Meas. Tech.Receptor [35S] GTPgammaS Binding Assays: (S1P1 GTPgammaS/S1P3 GTPgammaS)
EC50<10±n/a nM
Citation Dyckman, AJDhar, TGXiao, HGilmore, JLYang, MGXiao, ZMarcoux, D Substituted bicyclic compounds US Patent US10166249 Publication Date 1/1/2019
 
Sphingosine-1-phosphate lyase 1
Name:Sphingosine-1-phosphate lyase 1
Type:PROTEIN
Mol. Mass.:63546.76
Organism:Homo sapiens (Human)
Description:ChEMBL_108363
Residue:568
BDBM313254
NameBDBM313254
Synonyms:US10166249, Example 486
TypeSmall organic molecule
Emp. Form.C25H33FNO6P
Mol. Mass.493.5048
SMILESCOc1ccc(F)cc1COC[C@@H]1CCc2cc(ccc2C1)[C@@H]1CC[C@](N)(COP(O)(O)=O)C1