Reaction Details
TargetSphingosine 1-phosphate receptor 3
LigandBDBM65173
Substrate/Competitorn/a
Meas. Tech.Receptor [35S] GTPgammaS Binding Assays: (S1P1 GTPgammaS/S1P3 GTPgammaS)
EC50>625±n/a nM
Citation Dyckman, AJDhar, TGXiao, HGilmore, JLYang, MGXiao, ZMarcoux, D Substituted bicyclic compounds US Patent US10166249 Publication Date 1/1/2019
 
Sphingosine 1-phosphate receptor 3
Name:Sphingosine 1-phosphate receptor 3
Type:G Protein-Coupled Receptor (GPCR)
Mol. Mass.:42278.13
Organism:Homo sapiens (Human)
Description:Q99500
Residue:378
BDBM65173
NameBDBM65173
Synonyms:US10166249, Example 522 | US9522888, 522
Typen/a
Emp. Form.C25H34NO4PS
Mol. Mass.475.581
SMILESN[C@]1(COP(O)(O)=O)CC[C@@H](C1)c1ccc2C[C@H](CSCCc3ccccc3)CCc2c1