Reaction Details
TargetSphingosine-1-phosphate lyase 1
LigandBDBM313337
Substrate/Competitorn/a
Meas. Tech.Receptor [35S] GTPgammaS Binding Assays: (S1P1 GTPgammaS/S1P3 GTPgammaS)
EC50<10±n/a nM
Citation Dyckman, AJDhar, TGXiao, HGilmore, JLYang, MGXiao, ZMarcoux, D Substituted bicyclic compounds US Patent US10166249 Publication Date 1/1/2019
 
Sphingosine-1-phosphate lyase 1
Name:Sphingosine-1-phosphate lyase 1
Type:PROTEIN
Mol. Mass.:63546.76
Organism:Homo sapiens (Human)
Description:ChEMBL_108363
Residue:568
BDBM313337
NameBDBM313337
Synonyms:US10166249, Example 571 | US10166249, Example 572
TypeSmall organic molecule
Emp. Form.C23H30NO4P
Mol. Mass.415.4624
SMILESN[C@]1(COP(O)(O)=O)CC[C@@H](C1)c1ccc2CC(Cc3ccccc3)CCc2c1