Reaction Details
TargetSphingosine 1-phosphate receptor 3
LigandBDBM313354
Substrate/Competitorn/a
Meas. Tech.Receptor [35S] GTPgammaS Binding Assays: (S1P1 GTPgammaS/S1P3 GTPgammaS)
EC50>100±n/a nM
Citation Dyckman, AJDhar, TGXiao, HGilmore, JLYang, MGXiao, ZMarcoux, D Substituted bicyclic compounds US Patent US10166249 Publication Date 1/1/2019
 
Sphingosine 1-phosphate receptor 3
Name:Sphingosine 1-phosphate receptor 3
Type:G Protein-Coupled Receptor (GPCR)
Mol. Mass.:42278.13
Organism:Homo sapiens (Human)
Description:Q99500
Residue:378
BDBM313354
NameBDBM313354
Synonyms:US10166249, Example 589
TypeSmall organic molecule
Emp. Form.C23H32NO6PS
Mol. Mass.481.542
SMILESN[C@]1(COP(O)(O)=O)CC[C@@H](C1)c1ccc2C[C@@H](CCc2c1)OCCOCc1cccs1