Reaction Details
TargetInsulin-degrading enzyme
LigandBDBM314095
Substrate/Competitorn/a
Meas. Tech.In Vitro Protease Assay
IC50 5600±n/a nM
Citation Liu, DRMaianti, JPSaghatelian, AKleiner, RE Macrocyclic insulin-degrading enzyme (IDE) inhibitors and uses thereof US Patent US9610322 Publication Date 4/4/2017
 
Insulin-degrading enzyme
Name:Insulin-degrading enzyme
Type:Enzyme Catalytic Domain
Mol. Mass.:117968.59
Organism:Homo sapiens (Human)
Description:P14735
Residue:1019
BDBM314095
NameBDBM314095
Synonyms:US9610322, 6a (cis olefin)
TypeSmall organic molecule
Emp. Form.C43H55N5O7
Mol. Mass.753.9261
SMILESNC(=C)CC[C@@H]1NC(=O)\C=C\C(=O)N[C@H](CCCCCC(=O)C(Cc2ccc(cc2)C(=O)c2ccccc2)NC(=O)[C@H](CC2CCCCC2)CC1=O)C(N)=O