Reaction Details
TargetMAP kinase-interacting serine/threonine-protein kinase 2
LigandBDBM168266
Substrate/Competitorn/a
Meas. Tech.Mnk Biochemical Enzymatic Assay
Temperature298.15±n/a K
IC50<10.00±n/a nM
Commentsextracted
Citation Reich, SHSprengeler, PAWebber, SEXiang, AXErnst, JT MNK inhibitors and methods related thereto US Patent US9669031 Publication Date 6/6/2017
 
MAP kinase-interacting serine/threonine-protein kinase 2
Name:MAP kinase-interacting serine/threonine-protein kinase 2
Type:Protein
Mol. Mass.:51870.79
Organism:Homo sapiens (Human)
Description:Q9HBH9
Residue:465
BDBM168266
NameBDBM168266
Synonyms:US9669031, 94 6-[(6-aminopyrimidin-4-yl)amino]-8-chloro-spiro[2H-imidazo[1,5-a]pyridine-3,1′-cyclopentane]-1,5-dione (Cpd. No. 94)
TypeSmall organic molecule
Emp. Form.C20H23ClN6O4
Mol. Mass.446.887
SMILESCC(C)(C)OC(=O)Nc1cc(Nc2cc(Cl)c3C(=O)NC4(CCCC4)n3c2=O)ncn1