Reaction Details
TargetMAP kinase-interacting serine/threonine-protein kinase 2
LigandBDBM168309
Substrate/Competitorn/a
Meas. Tech.Mnk Biochemical Enzymatic Assay
Temperature298.15±n/a K
IC50<10.00±n/a nM
Commentsextracted
Citation Reich, SHSprengeler, PAWebber, SEXiang, AXErnst, JT MNK inhibitors and methods related thereto US Patent US9669031 Publication Date 6/6/2017
 
MAP kinase-interacting serine/threonine-protein kinase 2
Name:MAP kinase-interacting serine/threonine-protein kinase 2
Type:Protein
Mol. Mass.:51870.79
Organism:Homo sapiens (Human)
Description:Q9HBH9
Residue:465
BDBM168309
NameBDBM168309
Synonyms:US9669031, 143 8′-chloro-6′-((5-(1-methyl-1H-pyrazol-4-yl)pyrimidin-4-yl)amino)-2′H-spiro[cyclohexane-1,3′-imidazo[1,5-a]pyridine]-1′,5′-dione (Cpd. No. 143)
TypeSmall organic molecule
Emp. Form.C20H20ClN7O2
Mol. Mass.425.871
SMILESCn1cc(cn1)-c1cncnc1Nc1cc(Cl)c2C(=O)NC3(CCCCC3)n2c1=O