Reaction Details
TargetMAP kinase-interacting serine/threonine-protein kinase 2
LigandBDBM168333
Substrate/Competitorn/a
Meas. Tech.Mnk Biochemical Enzymatic Assay
Temperature298.15±n/a K
IC50<10.00±n/a nM
Commentsextracted
Citation Reich, SHSprengeler, PAWebber, SEXiang, AXErnst, JT MNK inhibitors and methods related thereto US Patent US9669031 Publication Date 6/6/2017
 
MAP kinase-interacting serine/threonine-protein kinase 2
Name:MAP kinase-interacting serine/threonine-protein kinase 2
Type:Protein
Mol. Mass.:51870.79
Organism:Homo sapiens (Human)
Description:Q9HBH9
Residue:465
BDBM168333
NameBDBM168333
Synonyms:US9669031, 169 6′-((6-amino-5-fluoropyrimidin-4-yl)amino)-8′-chloro-2′H-spiro[cyclohexane-1,3′-imidazo[1,5-a]pyridine]-1′,5′-dione hydrochloride (Cpd. No. 169)
TypeSmall organic molecule
Emp. Form.C20H20ClFN6O3
Mol. Mass.446.863
SMILESFc1c(NC(=O)C2CC2)ncnc1Nc1cc(Cl)c2C(=O)NC3(CCCCC3)n2c1=O