Reaction Details
TargetMAP kinase-interacting serine/threonine-protein kinase 2
LigandBDBM168346
Substrate/Competitorn/a
Meas. Tech.Mnk Biochemical Enzymatic Assay
Temperature298.15±n/a K
IC50<10.00±n/a nM
Commentsextracted
Citation Reich, SHSprengeler, PAWebber, SEXiang, AXErnst, JT MNK inhibitors and methods related thereto US Patent US9669031 Publication Date 6/6/2017
 
MAP kinase-interacting serine/threonine-protein kinase 2
Name:MAP kinase-interacting serine/threonine-protein kinase 2
Type:Protein
Mol. Mass.:51870.79
Organism:Homo sapiens (Human)
Description:Q9HBH9
Residue:465
BDBM168346
NameBDBM168346
Synonyms:US9669031, 195 6′-((6-amino-5-methoxypyrimidin-4-yl)amino)-8′-chloro-2′H-spiro[cyclohexane-1,3′-imidazo[1,5-a]pyridine]-1′,5′-dione hydrochloride (Cpd. No. 195)
TypeSmall organic molecule
Emp. Form.C27H35ClN6O7
Mol. Mass.591.056
SMILESCOc1c(Nc2cc(Cl)c3C(=O)NC4(CCCCC4)n3c2=O)ncnc1N(C(=O)OC(C)(C)C)C(=O)OC(C)(C)C