Reaction Details
TargetMAP kinase-interacting serine/threonine-protein kinase 2
LigandBDBM168369
Substrate/Competitorn/a
Meas. Tech.Mnk Biochemical Enzymatic Assay
Temperature298.15±n/a K
IC50<10.00±n/a nM
Commentsextracted
Citation Reich, SHSprengeler, PAWebber, SEXiang, AXErnst, JT MNK inhibitors and methods related thereto US Patent US9669031 Publication Date 6/6/2017
 
MAP kinase-interacting serine/threonine-protein kinase 2
Name:MAP kinase-interacting serine/threonine-protein kinase 2
Type:Protein
Mol. Mass.:51870.79
Organism:Homo sapiens (Human)
Description:Q9HBH9
Residue:465
BDBM168369
NameBDBM168369
Synonyms:US9669031, 222 6′-((6-amino-5-methylpyrimidin-4-yl)amino)-8′-methyl-2′H-spiro[cyclohexane-1,3′-imidazo[1,5-a]pyridine]-1′,5′-dione (Cpd. No. 222)
TypeSmall organic molecule
Emp. Form.C22H26N6O3
Mol. Mass.422.4802
SMILESCc1cc(Nc2ncnc(NC(=O)C3CC3)c2C)c(=O)n2c1C(=O)NC21CCCCC1