Reaction Details
TargetOrexin/Hypocretin receptor type 1
LigandBDBM314443
Substrate/Competitorn/a
Meas. Tech.Receptor Radioligand Binding Assay
Ki 3.00±n/a nM
Citation Shireman, BTLebold, TPDvorak, CACoate, HRZiff, JMPreville, CGelin, CChen, G Substituted 2-azabicycles and their use as orexin receptor modulators US Patent US9611262 Publication Date 4/4/2017
 
Orexin/Hypocretin receptor type 1
Name:Orexin/Hypocretin receptor type 1
Type:Protein
Mol. Mass.:46817.55
Organism:Rattus norvegicus (Rat)
Description:P56718
Residue:416
BDBM314443
NameBDBM314443
Synonyms:(R/S)-(5-fluoro-2-(pyrimidin-2-yl)phenyl)(−3-methyl-6-((5-(trifluoromethyl)pyridin-2-yl)oxy)-2-azabicyclo[2.2.1]heptan-2-yl)methanone US9611262, Example 18 | US9611262, Example 18B
TypeSmall organic molecule
Emp. Form.C24H20F4N4O2
Mol. Mass.472.4348
SMILESCC1C2CC(Oc3ccc(cn3)C(F)(F)F)C(C2)N1C(=O)c1cc(F)ccc1-c1ncccn1