Reaction Details
TargetOrexin/Hypocretin receptor type 1
LigandBDBM314415
Substrate/Competitorn/a
Meas. Tech.Receptor Radioligand Binding Assay
Ki 3.00±n/a nM
Citation Shireman, BTLebold, TPDvorak, CACoate, HRZiff, JMPreville, CGelin, CChen, G Substituted 2-azabicycles and their use as orexin receptor modulators US Patent US9611262 Publication Date 4/4/2017
 
Orexin/Hypocretin receptor type 1
Name:Orexin/Hypocretin receptor type 1
Type:Protein
Mol. Mass.:47554.50
Organism:Homo sapiens (Human)
Description:O43613
Residue:425
BDBM314415
NameBDBM314415
Synonyms:(R/S)-(2-(2H-1,2,3-triazol-2-yl)phenyl)(3-methyl-6-((5-(trifluoromethyl)pyridin-2-yl)oxy)-2-azabicyclo[2.2.1]heptan-2-yl)methanone US9611262, Example 201 US9611262, Example 21A US9611262, Example 2A | US9611262, Example 2B
TypeSmall organic molecule
Emp. Form.C22H20F3N5O2
Mol. Mass.443.4217
SMILESCC1C2CC(Oc3ccc(cn3)C(F)(F)F)C(C2)N1C(=O)c1ccccc1-n1nccn1