Reaction Details
TargetOrexin/Hypocretin receptor type 1
LigandBDBM314639
Substrate/Competitorn/a
Meas. Tech.Receptor Radioligand Binding Assay
Ki 3.00±n/a nM
Citation Shireman, BTLebold, TPDvorak, CACoate, HRZiff, JMPreville, CGelin, CChen, G Substituted 2-azabicycles and their use as orexin receptor modulators US Patent US9611262 Publication Date 4/4/2017
 
Orexin/Hypocretin receptor type 1
Name:Orexin/Hypocretin receptor type 1
Type:Protein
Mol. Mass.:46817.55
Organism:Rattus norvegicus (Rat)
Description:P56718
Residue:416
BDBM314639
NameBDBM314639
Synonyms:US9611262, Example 173 | [2-(6-fluoro-2-pyridyl)phenyl]-[(1R,2R,4S,5R)-2-methyl-5-[[5-(trifluoromethyl)-2-pyridyl]oxy]-3-azabicyclo[2.2.1]heptan-3-yl]methanone
TypeSmall organic molecule
Emp. Form.C25H21F4N3O2
Mol. Mass.471.4468
SMILESCC1C2CC(Oc3ccc(cn3)C(F)(F)F)C(C2)N1C(=O)c1ccccc1-c1cccc(F)n1