Reaction Details
TargetMyeloperoxidase
LigandBDBM312171
Substrate/Competitorn/a
Meas. Tech.Inhibitory Activity
IC50 7.00±n/a nM
Citation Inghardt, TBJohannesson, PJurva, ULindstedt-Alstermark, ETomkinson, NStonehouse, JP 1-[2-(aminomethyl)benzyl]-2-thioxo-1,2,3,5-tetrahydro-4H-pyrrolo[3,2-d]pyrimidin-4-ones as inhibitors of myeloperoxidase US Patent US9616063 Publication Date 4/11/2017
 
Myeloperoxidase
Name:Myeloperoxidase
Type:Enzyme
Mol. Mass.:83888.32
Organism:Homo sapiens (Human)
Description:P05164
Residue:745
BDBM312171
NameBDBM312171
Synonyms:1-[2-(1-Aminoethyl)-4-chlorobenzyl]-2-thioxo-1,2,3,5-tetrahydro-4H-pyrrolo[3,2-d]pyrimidin-4-one US11000525, Example 2 | US9616063, 2
TypeSmall organic molecule
Emp. Form.C15H15ClN4OS
Mol. Mass.334.824
SMILESCC(N)c1cc(Cl)ccc1Cn1c2cc[nH]c2c(=O)[nH]c1=S