Reaction Details
TargetMyeloperoxidase
LigandBDBM312256
Substrate/Competitorn/a
Meas. Tech.Inhibitory Activity
IC50 10.00±n/a nM
Citation Inghardt, TBJohannesson, PJurva, ULindstedt-Alstermark, ETomkinson, NStonehouse, JP 1-[2-(aminomethyl)benzyl]-2-thioxo-1,2,3,5-tetrahydro-4H-pyrrolo[3,2-d]pyrimidin-4-ones as inhibitors of myeloperoxidase US Patent US9616063 Publication Date 4/11/2017
 
Myeloperoxidase
Name:Myeloperoxidase
Type:Enzyme
Mol. Mass.:83888.32
Organism:Homo sapiens (Human)
Description:P05164
Residue:745
BDBM312256
NameBDBM312256
Synonyms:1-{2-[(Cyclobutylamino)methyl]benzyl}-2-thioxo-1,2,3,5-tetrahydro-4H-pyrrolo[3,2-d]pyrimidin-4-one US11000525, Example 10 | US9616063, 10
TypeSmall organic molecule
Emp. Form.C18H20N4OS
Mol. Mass.340.443
SMILESO=c1[nH]c(=S)n(Cc2ccccc2CNC2CCC2)c2cc[nH]c12