Reaction Details
TargetAmine oxidase [flavin-containing] B
LigandBDBM254552
Substrate/Competitorn/a
Meas. Tech.Monoamine Oxidase Assays
Ki 20500±n/a nM
Citation Ortega Muñoz, AFyfe, MCMartinell Pedemonte, MEstiarte Martinez, MValls Vidal, NKurz, GCastro Palomino Laria, JC (Hetero)aryl cyclopropylamine compounds as LSD1 inhibitors US Patent US9670136 Publication Date 6/6/2017
 
Amine oxidase [flavin-containing] B
Name:Amine oxidase [flavin-containing] B
Type:Protein
Mol. Mass.:58768.76
Organism:Homo sapiens (Human)
Description:P27338
Residue:520
BDBM254552
NameBDBM254552
Synonyms:US9469597, 11 | US9670136, 11 4-(((trans)-2-(6-(3-(trifluoromethyl)phenyl)pyridin-3-yl)cyclopropyl)amino)cyclohexanol
TypeSmall organic molecule
Emp. Form.C21H23F3N2O
Mol. Mass.376.4153
SMILESOC1CCC(CC1)N[C@H]1C[C@@H]1c1ccc(nc1)-c1cccc(c1)C(F)(F)F