Reaction Details
TargetLysine-specific histone demethylase 1A
LigandBDBM254554
Substrate/Competitorn/a
Meas. Tech.LSD1 Assays
pH7.4±n/a
Temperature298.15±n/a K
Ki 550±n/a nM
Commentsextracted
Citation Ortega Muñoz, AFyfe, MCMartinell Pedemonte, MEstiarte Martinez, MValls Vidal, NKurz, GCastro Palomino Laria, JC (Hetero)aryl cyclopropylamine compounds as LSD1 inhibitors US Patent US9670136 Publication Date 6/6/2017
 
Lysine-specific histone demethylase 1A
Name:Lysine-specific histone demethylase 1A
Type:Enzyme
Mol. Mass.:92901.01
Organism:Homo sapiens (Human)
Description:O60341
Residue:852
BDBM254554
NameBDBM254554
Synonyms:US10214477, Example 13 US9670136, 13 N-(4-(((trans)-2-(6-(3-(trifluoromethyl)phenyl)pyridin-3-yl)cyclopropyl)amino)cyclohexyl)acetamide
TypeSmall organic molecule
Emp. Form.C23H26F3N3O
Mol. Mass.417.4672
SMILESCC(=O)NC1CCC(CC1)N[C@H]1C[C@@H]1c1ccc(nc1)-c1cccc(c1)C(F)(F)F