Reaction Details
TargetLysine-specific histone demethylase 1A
LigandBDBM254547
Substrate/Competitorn/a
Meas. Tech.LSD1 Assays
pH7.4±n/a
Temperature298.15±n/a K
IC50 34±n/a nM
Commentsextracted
Citation Ortega Muñoz, AFyfe, MCMartinell Pedemonte, MEstiarte Martinez, MValls Vidal, NKurz, GCastro Palomino Laria, JC (Hetero)aryl cyclopropylamine compounds as LSD1 inhibitors US Patent US9670136 Publication Date 6/6/2017
 
Lysine-specific histone demethylase 1A
Name:Lysine-specific histone demethylase 1A
Type:Enzyme
Mol. Mass.:92901.01
Organism:Homo sapiens (Human)
Description:O60341
Residue:852
BDBM254547
NameBDBM254547
Synonyms:US10214477, Example 6 US9670136, 6 N1-((trans)-2-(thiazol-5-yl)cyclopropyl)cyclohexane-1,4-diamine
TypeSmall organic molecule
Emp. Form.C12H19N3S
Mol. Mass.237.364
SMILESNC1CCC(CC1)N[C@H]1C[C@@H]1c1cncs1