Reaction Details
TargetLysine-specific histone demethylase 1A
LigandBDBM254581
Substrate/Competitorn/a
Meas. Tech.LSD1 Assays
pH7.4±n/a
Temperature298.15±n/a K
IC50 34±n/a nM
Commentsextracted
Citation Ortega Muñoz, AFyfe, MCMartinell Pedemonte, MEstiarte Martinez, MValls Vidal, NKurz, GCastro Palomino Laria, JC (Hetero)aryl cyclopropylamine compounds as LSD1 inhibitors US Patent US9670136 Publication Date 6/6/2017
 
Lysine-specific histone demethylase 1A
Name:Lysine-specific histone demethylase 1A
Type:Enzyme
Mol. Mass.:92901.01
Organism:Homo sapiens (Human)
Description:O60341
Residue:852
BDBM254581
NameBDBM254581
Synonyms:US10214477, Example 40 US9670136, 40 N1-((trans)-2-(4-cyclopropylphenyl)cyclopropyl)cyclohexane-1,4-diamine
TypeSmall organic molecule
Emp. Form.C18H26N2
Mol. Mass.270.4124
SMILESNC1CCC(CC1)N[C@H]1C[C@@H]1c1ccc(cc1)C1CC1