Reaction Details
TargetLysine-specific histone demethylase 1A
LigandBDBM254583
Substrate/Competitorn/a
Meas. Tech.LSD1 Assays
pH7.4±n/a
Temperature298.15±n/a K
IC50 27±n/a nM
Commentsextracted
Citation Ortega Muñoz, AFyfe, MCMartinell Pedemonte, MEstiarte Martinez, MValls Vidal, NKurz, GCastro Palomino Laria, JC (Hetero)aryl cyclopropylamine compounds as LSD1 inhibitors US Patent US9670136 Publication Date 6/6/2017
 
Lysine-specific histone demethylase 1A
Name:Lysine-specific histone demethylase 1A
Type:Enzyme
Mol. Mass.:92901.01
Organism:Homo sapiens (Human)
Description:O60341
Residue:852
BDBM254583
NameBDBM254583
Synonyms:US9469597, 42 | US9670136, 42 N1-((trans)-2-(4-(1H-indazol-6-yl)phenyl)cyclopropyl)cyclohexane-1,4-diamine
TypeSmall organic molecule
Emp. Form.C22H26N4
Mol. Mass.346.4686
SMILESNC1CCC(CC1)N[C@H]1C[C@@H]1c1ccc(cc1)-c1ccc2cn[nH]c2c1