Reaction Details
TargetVasopressin V1a receptor
LigandBDBM316327
Substrate/Competitorn/a
Meas. Tech.Binding Assay
Ki<1±n/a nM
Citation Braje, WFroggett, JGeneste, HHornberger, WJantos, KKling, Avan Gaalen, M Fused heterocyclic or carbocyclic compounds carrying a substituted cycloaliphatic radical and use thereof for treating vasopressin-related diseases US Patent US9617226 Publication Date 4/11/2017
 
Vasopressin V1a receptor
Name:Vasopressin V1a receptor
Type:Receptor
Mol. Mass.:46820.18
Organism:Homo sapiens (Human)
Description:P37288
Residue:418
BDBM316327
NameBDBM316327
Synonyms:US9617226, Example 8 | cis-2-[2-(3-Chlorophenyl)-4-oxo-6-[3-(thiomorpholinomethyl)cyclobutyl]quinazolin-3-yl]-N-isopropyl-acetamide
TypeSmall organic molecule
Emp. Form.C28H33ClN4O2S
Mol. Mass.525.105
SMILESCC(C)NC(=O)Cn1c(nc2ccc(cc2c1=O)[C@@H]1C[C@H](CN2CCSCC2)C1)-c1cccc(Cl)c1