Reaction Details
TargetHigh affinity cGMP-specific 3',5'-cyclic phosphodiesterase 9A
LigandBDBM317074
Substrate/Competitorn/a
Meas. Tech.Inhibition Assay
IC50 4.00±n/a nM
Citation Luo, HWan, YKe, HLiu, PHuang, MShao, YZhu, XCai, YLiu, Y N-substituted pyrazolo [3,4-D] pyrimidine ketone compound, and preparation process and use thereof US Patent US9617269 Publication Date 4/11/2017
 
High affinity cGMP-specific 3',5'-cyclic phosphodiesterase 9A
Name:High affinity cGMP-specific 3',5'-cyclic phosphodiesterase 9A
Type:Protein
Mol. Mass.:68488.40
Organism:Homo sapiens (Human)
Description:O76083
Residue:593
BDBM317074
NameBDBM317074
Synonyms:US9617269, Compound WYQ-25
TypeSmall organic molecule
Emp. Form.C17H18ClN5O
Mol. Mass.343.811
SMILESClc1ccc(CNc2nc3n(ncc3c(=O)[nH]2)C2CCCC2)cc1