Reaction Details
TargetEstrogen receptor beta
LigandBDBM312151
Substrate/Competitorn/a
Meas. Tech.Binding Assay
Ki 1.66±n/a nM
Citation Narayanan, RYepuru, MDalton, JT Nuclear receptor binding agents US Patent US9623021 Publication Date 4/18/2017
 
Estrogen receptor beta
Name:Estrogen receptor beta
Type:Protein
Mol. Mass.:59238.43
Organism:Homo sapiens (Human)
Description:Q92731
Residue:530
BDBM312151
NameBDBM312151
Synonyms:(E)-6,8-dihydroxy-2-(4-hydroxyphenyl)-4-(prop-1-enyl)isoquinolin-1(2H)-one US9623021, Compound 15i
TypeSmall organic molecule
Emp. Form.C18H15NO4
Mol. Mass.309.316
SMILESC\C=C\c1cn(-c2ccc(O)cc2)c(=O)c2c(O)cc(O)cc12