Reaction Details
TargetcAMP and cAMP-inhibited cGMP 3',5'-cyclic phosphodiesterase 10A
LigandBDBM187169
Substrate/Competitorn/a
Meas. Tech.Phosphodiesterase Assay
pH7.4±n/a
Temperature298.15±n/a K
IC50 0.34±n/a nM
Commentsextracted
Citation Leblond, BChauvignac, CTaverne, TBeausoleil, ECasagrande, ADesire, LPando, MPDonello, JEYang, R Substituted 6,7-dialkoxy-3-isoquinolinol derivatives as inhibitors of phosphodiesterase 10 (PDE 10A) US Patent US9670181 Publication Date 6/6/2017
 
cAMP and cAMP-inhibited cGMP 3',5'-cyclic phosphodiesterase 10A
Name:cAMP and cAMP-inhibited cGMP 3',5'-cyclic phosphodiesterase 10A
Type:Protein
Mol. Mass.:88412.52
Organism:Homo sapiens (Human)
Description:Q9Y233
Residue:1055
BDBM187169
NameBDBM187169
Synonyms:US9670181, 48 6,7-dimethoxy-4-((6-methoxy-2-(methylamino)quinolin-3-yl)methyl)-1-propylisoquinolin-3-ol | US9670181, 50 4-((2-(ethylamino)-6-methoxyquinolin-3-yl)methyl)-6,7-dimethoxy-1-propylisoquinolin-3-ol
TypeSmall organic molecule
Emp. Form.C27H31N3O4
Mol. Mass.461.5527
SMILESCCCc1nc(O)c(Cc2cc3cc(OC)ccc3nc2NCC)c2cc(OC)c(OC)cc12