Reaction Details
TargetcAMP and cAMP-inhibited cGMP 3',5'-cyclic phosphodiesterase 10A
LigandBDBM187184
Substrate/Competitorn/a
Meas. Tech.Phosphodiesterase Assay
pH7.4±n/a
Temperature298.15±n/a K
IC50 1.10±n/a nM
Commentsextracted
Citation Leblond, BChauvignac, CTaverne, TBeausoleil, ECasagrande, ADesire, LPando, MPDonello, JEYang, R Substituted 6,7-dialkoxy-3-isoquinolinol derivatives as inhibitors of phosphodiesterase 10 (PDE 10A) US Patent US9670181 Publication Date 6/6/2017
 
cAMP and cAMP-inhibited cGMP 3',5'-cyclic phosphodiesterase 10A
Name:cAMP and cAMP-inhibited cGMP 3',5'-cyclic phosphodiesterase 10A
Type:Protein
Mol. Mass.:88412.52
Organism:Homo sapiens (Human)
Description:Q9Y233
Residue:1055
BDBM187184
NameBDBM187184
Synonyms:US9670181, 62 6,7-dimethoxy-4-((6-(methylamino)-[1,3]dioxolo[4,5-g]quinolin-7-yl)methyl)-1-propylisoquinolin-3-ol
TypeSmall organic molecule
Emp. Form.C26H27N3O5
Mol. Mass.461.5097
SMILESCCCc1nc(O)c(Cc2cc3cc4OCOc4cc3nc2NC)c2cc(OC)c(OC)cc12