Reaction Details
TargetCarbonic anhydrase 2
LigandBDBM11053
Substrate/CompetitorBDBM10856
Meas. Tech.CA Inhibition Assay
Ki 16±n/a nM
Citation De Simone, GVitale, RMDi Fiore, APedone, CScozzafava, AMontero, JLWinum, JYSupuran, CT Carbonic anhydrase inhibitors: Hypoxia-activatable sulfonamides incorporating disulfide bonds that target the tumor-associated isoform IX. J Med Chem49:5544-51 (2006) 
 
Carbonic anhydrase 2
Name:Carbonic anhydrase 2
Type:Enzyme
Mol. Mass.:29250.71
Organism:Homo sapiens (Human)
Description:P00918
Residue:260
BDBM11053
BDBM10856
NameBDBM11053
Synonyms:CHEMBL386049 reduced monomeric thio of compound 5a | reduced thio H5a
TypeSmall organic molecule
Emp. Form.C13H12N2O3S2
Mol. Mass.308.376
SMILESNS(=O)(=O)c1ccc(NC(=O)c2ccccc2S)cc1