Reaction Details
TargetCarbonic anhydrase 9
LigandBDBM10889
Substrate/CompetitorBDBM10856
Meas. Tech.CA Inhibition Assay
Ki 31±n/a nM
Citation De Simone, GVitale, RMDi Fiore, APedone, CScozzafava, AMontero, JLWinum, JYSupuran, CT Carbonic anhydrase inhibitors: Hypoxia-activatable sulfonamides incorporating disulfide bonds that target the tumor-associated isoform IX. J Med Chem49:5544-51 (2006) 
 
Carbonic anhydrase 9
Name:Carbonic anhydrase 9
Type:Enzyme
Mol. Mass.:49669.03
Organism:Homo sapiens (Human)
Description:Catalytic domain of human cloned isozyme was used in the assay
Residue:459
BDBM10889
BDBM10856
NameBDBM10889
Synonyms:2-methoxy-N-[(1-methylpyrrolidin-2-yl)methyl]-5-sulfamoylbenzamide Sulpiride (SLP)
TypeSmall organic molecule
Emp. Form.C14H21N3O4S
Mol. Mass.327.399
SMILESCOc1ccc(cc1C(=O)NCC1CCCN1C)S(N)(=O)=O