Reaction Details
TargetDNA-(apurinic or apyrimidinic site) endonuclease
LigandBDBM50303955
Substrate/Competitorn/a
Meas. Tech.Inhibition Assay
IC50 14700±n/a nM
Citation Gold, BIXie, XSrinivasan, AWang, L Compounds and methods for inhibition of AP endonuclease-1/redox factor-1 (HAPE1) activity US Patent US9624235 Publication Date 4/18/2017
 
DNA-(apurinic or apyrimidinic site) endonuclease
Name:DNA-(apurinic or apyrimidinic site) endonuclease
Type:Protein
Mol. Mass.:35560.12
Organism:Homo sapiens (Human)
Description:P27695
Residue:318
BDBM50303955
NameBDBM50303955
Synonyms:(E)-3-(5,6-Dimethoxy-3-methyl-14-dioxocyclohexa-25-dienyl)-2-nonylpropenoic Acid E3330 | US9624235, Compound E3330
TypeSmall organic molecule
Emp. Form.C21H30O6
Mol. Mass.378.4593
SMILESCCCCCCCCCC(=CC1=C(C)C(=O)C(OC)=C(OC)C1=O)C(O)=O