Reaction Details
TargetInterleukin-1 receptor-associated kinase 1 [194-712]
LigandBDBM318829
Substrate/Competitorn/a
Meas. Tech.Enzymatic Assay
IC50<100±n/a nM
Citation Chen, XLan, RJorand-Lebrun, CYu, HGoutopoulos, A Pyridazinone macrocycles as IRAK inhibitors and uses thereof US Patent US9624246 Publication Date 4/18/2017
 
Interleukin-1 receptor-associated kinase 1 [194-712]
Name:Interleukin-1 receptor-associated kinase 1 [194-712]
Type:Enzyme Catalytic Domain
Mol. Mass.:55943.99
Organism:Homo sapiens (Human)
Description:aa 194-712
Residue:519
BDBM318829
NameBDBM318829
Synonyms:US10517872, Compound 6 | US9624246, Compound 6
TypeSmall organic molecule
Emp. Form.C24H26N6O5
Mol. Mass.478.5004
SMILESO=C1NCCCOc2ccc(=O)n(Cc3cccc(c3)C(=O)Nc3cn(nc13)C1CCOCC1)n2