Reaction Details
TargetSolute carrier family 22 member 12
LigandBDBM318943
Substrate/Competitorn/a
Meas. Tech.HEK-URAT1 assay
IC50 3440±n/a nM
Citation Endo, TKobayashi, KTanaka, HSaito, DHirano, MEndou, HAnzai, N URAT1 inhibitor US Patent US10173990 Publication Date 1/8/2019
 
Solute carrier family 22 member 12
Name:Solute carrier family 22 member 12
Type:Enzyme
Mol. Mass.:59638.65
Organism:Homo sapiens (Human)
Description:Q96S37
Residue:553
BDBM318943
NameBDBM318943
Synonyms:2-[[5-(4-Cyanophenyl)quinolin-6-yl]thio]-2-methylpropanoic acid | US10173990, Example 15
TypeSmall organic molecule
Emp. Form.C20H16N2O2S
Mol. Mass.348.418
SMILESCC(C)(Sc1ccc2ncccc2c1-c1ccc(cc1)[N+]#[C-])C(O)=O