Reaction Details
TargetSolute carrier family 22 member 12
LigandBDBM318955
Substrate/Competitorn/a
Meas. Tech.HEK-URAT1 assay
IC50 474±n/a nM
Citation Endo, TKobayashi, KTanaka, HSaito, DHirano, MEndou, HAnzai, N URAT1 inhibitor US Patent US10173990 Publication Date 1/8/2019
 
Solute carrier family 22 member 12
Name:Solute carrier family 22 member 12
Type:Enzyme
Mol. Mass.:59638.65
Organism:Homo sapiens (Human)
Description:Q96S37
Residue:553
BDBM318955
NameBDBM318955
Synonyms:2-[[7-(4-Cyanophenyl)benzo[d]isothiazol-6-yl]thio]-3,3-dimethylbutanoic acid | US10173990, Example 114
TypeSmall organic molecule
Emp. Form.C20H18N2O2S2
Mol. Mass.382.499
SMILESCC(C)(C)C(Sc1ccc2cnsc2c1-c1ccc(cc1)C#N)C(O)=O