Reaction Details
TargetEndothelial lipase
LigandBDBM319483
Substrate/Competitorn/a
Meas. Tech.Biological Activity
IC50 1.000±n/a nM
Citation Johnson, JAPi, ZQiao, JXKim, SWang, TCJiang, JFinlay, HLloyd, J Sulfone amide linked benzothiazole inhibitors of endothelial lipase US Patent US10173991 Publication Date 1/8/2019
 
Endothelial lipase
Name:Endothelial lipase
Type:Protein
Mol. Mass.:56805.62
Organism:Homo sapiens (Human)
Description:Q9Y5X9
Residue:500
BDBM319483
NameBDBM319483
Synonyms:US10173991, Example 539 | propan-2-yl N-{4- [2-({[(cyclopropyl- carbamoyl)methyl] carbamoyl} (methanesulfonyl) methyl)-5-fluoro- 1,3-benzothiazol- 6-yl]phenyl} carbamate
TypeSmall organic molecule
Emp. Form.C25H27FN4O7S2
Mol. Mass.578.633
SMILESCC(C)OC(=O)Nc1ccc(cc1)-c1cc2sc(nc2cc1F)C(C(=O)NCC(=O)NC1CC1)S(=O)(=O)CO