Reaction Details
TargetEndothelial lipase
LigandBDBM319516
Substrate/Competitorn/a
Meas. Tech.Biological Activity
IC50 1.000±n/a nM
Citation Johnson, JAPi, ZQiao, JXKim, SWang, TCJiang, JFinlay, HLloyd, J Sulfone amide linked benzothiazole inhibitors of endothelial lipase US Patent US10173991 Publication Date 1/8/2019
 
Endothelial lipase
Name:Endothelial lipase
Type:Protein
Mol. Mass.:56805.62
Organism:Homo sapiens (Human)
Description:Q9Y5X9
Residue:500
BDBM319516
NameBDBM319516
Synonyms:N-{4-[2- ({[(cyclopropyl- carbamoyl)methyl] carbamoyl} (methanesulfonyl) methyl)-5-fluoro- 1,3-benzothiazol- 6-yl]phenyl}-3- phenyl-propanamide | US10173991, Example 576
TypeSmall organic molecule
Emp. Form.C30H29FN4O5S2
Mol. Mass.608.703
SMILESCS(=O)(=O)C(C(=O)NCC(=O)NC1CC1)c1nc2cc(F)c(cc2s1)-c1ccc(NC(=O)CCc2ccccc2)cc1