Reaction Details
TargetKetohexokinase
LigandBDBM319585
Substrate/Competitorn/a
Meas. Tech.KHK Assay B
IC50 8.40±n/a nM
Citation Dowling, MFernando, DFutatsugi, KHuard, KMagee, TVRaymer, BShavnya, ASmith, AThuma, BTsai, ATu, M Substituted 3-azabicyclo[3.1.0]hexanes as ketohexokinase inhibitors US Patent US10174007 Publication Date 1/8/2019
 
Ketohexokinase
Name:Ketohexokinase
Type:Enzyme Catalytic Domain
Mol. Mass.:32521.64
Organism:Homo sapiens (Human)
Description:n/a
Residue:298
BDBM319585
NameBDBM319585
Synonyms:US10174007, Example 4 US10988463, Example 4 | US11634410, Example 4
TypeSmall organic molecule
Emp. Form.C16H19F3N4O2
Mol. Mass.356.3429
SMILESC[C@H]1CCN1c1nc(cc(n1)C(F)(F)F)N1C[C@H]2[C@H](CC(O)=O)[C@H]2C1