Reaction Details
TargetKetohexokinase
LigandBDBM319591
Substrate/Competitorn/a
Meas. Tech.KHK Assay A
IC50 682±n/a nM
Citation Dowling, MFernando, DFutatsugi, KHuard, KMagee, TVRaymer, BShavnya, ASmith, AThuma, BTsai, ATu, M Substituted 3-azabicyclo[3.1.0]hexanes as ketohexokinase inhibitors US Patent US10174007 Publication Date 1/8/2019
 
Ketohexokinase
Name:Ketohexokinase
Type:Enzyme Catalytic Domain
Mol. Mass.:32521.64
Organism:Homo sapiens (Human)
Description:n/a
Residue:298
BDBM319591
NameBDBM319591
Synonyms:US10174007, Example 10 US10988463, Example 10 | US11634410, Example 10
TypeSmall organic molecule
Emp. Form.C17H22F3N5O3S
Mol. Mass.433.448
SMILESC[C@H]1CCN1c1nc(cc(n1)C(F)(F)F)N1C[C@H]2[C@H](CC(=O)NS(C)(=O)=O)[C@H]2C1