Reaction Details
TargetMelanocortin receptor 4
LigandBDBM135717
Substrate/Competitorn/a
Meas. Tech.Assay for Agonist Activity
Ki 0.700±n/a nM
Citation Shi, YSharma, SDDodd, JHYang, W Melanocortin receptor-specific peptides US Patent US10179804 Publication Date 1/15/2019
 
Melanocortin receptor 4
Name:Melanocortin receptor 4
Type:Enzyme
Mol. Mass.:36949.50
Organism:Homo sapiens (Human)
Description:P32245
Residue:332
BDBM135717
NameBDBM135717
Synonyms:US10179804, Example 102 US8846601, 102 | US9458201, 102
TypeSmall organic molecule
Emp. Form.C50H75N19O9
Mol. Mass.1086.2524
SMILESCC(=O)N[C@@H](CCCNC(N)=N)C(=O)N[C@H]1CCC(=O)NCCC[C@H](NC(=O)[C@H](Cc2c[nH]c3ccccc23)NC(=O)[C@H](CCCNC(N)=N)NC(=O)[C@@H](Cc2ccccc2)NC(=O)[C@H](CCCNC(N)=N)NC1=O)C(N)=O