Reaction Details
TargetCarbonic anhydrase 2
LigandBDBM11390
Substrate/CompetitorBDBM10856
Meas. Tech.CA Inhibition Assay
pH7.2±n/a
Temperature277.15±n/a K
IC50 1.15±n/a nM
Citation Chen, HHGross, SLiao, JMcLaughlin, MDean, TSly, WSMay, JA 2H-Thieno[3,2-e]- and [2,3-e]-1,2-thiazine-6-sulfonamide 1,1-dioxides as ocular hypotensive agents: synthesis, carbonic anhydrase inhibition and evaluation in the rabbit. Bioorg Med Chem8:957-75 (2000) 
 
Carbonic anhydrase 2
Name:Carbonic anhydrase 2
Type:Enzyme
Mol. Mass.:29250.71
Organism:Homo sapiens (Human)
Description:P00918
Residue:260
BDBM11390
BDBM10856
NameBDBM11390
Synonyms:2-(3-Hydroxyphenyl)-3-(4-morpholinylmethyl)-2H-thieno-[3,2-e]-1,2-thiazine-6-sulfonamide 1,1-dioxide AL-6619 | Compound 17p1
TypeSmall organic molecule
Emp. Form.C17H19N3O6S3
Mol. Mass.457.544
SMILESNS(=O)(=O)c1cc2C=C(CN3CCOCC3)N(c3cccc(O)c3)S(=O)(=O)c2s1