Reaction Details
TargetCarbonic anhydrase 2
LigandBDBM10885
Substrate/CompetitorBDBM10856
Meas. Tech.CA Inhibition Assay
pH7.2±n/a
Temperature277.15±n/a K
IC50 3.2±n/a nM
Citation Chen, HHGross, SLiao, JMcLaughlin, MDean, TSly, WSMay, JA 2H-Thieno[3,2-e]- and [2,3-e]-1,2-thiazine-6-sulfonamide 1,1-dioxides as ocular hypotensive agents: synthesis, carbonic anhydrase inhibition and evaluation in the rabbit. Bioorg Med Chem8:957-75 (2000) 
 
Carbonic anhydrase 2
Name:Carbonic anhydrase 2
Type:Enzyme
Mol. Mass.:29250.71
Organism:Homo sapiens (Human)
Description:P00918
Residue:260
BDBM10885
BDBM10856
NameBDBM10885
Synonyms:(4R)-4-(ethylamino)-2-(3-methoxypropyl)-1,1-dioxo-2H,3H,4H-1,7,2-thieno[3,2-e][1,2]thiazine-6-sulfonamide AL-4862 Brinzolamide (BRZ) | brinzolamide
TypeSmall organic molecule
Emp. Form.C12H21N3O5S3
Mol. Mass.383.507
SMILESCCN[C@H]1CN(CCCOC)S(=O)(=O)c2sc(cc12)S(N)(=O)=O