Reaction Details
TargetCarbonic anhydrase 2
LigandBDBM11404
Substrate/CompetitorBDBM11402
Meas. Tech.In vitro binding of inhibitor to hCA-II
pH7.4±n/a
Temperature310.15±n/a K
Ki 0.08±0.01 nM
Citation Chen, HHGross, SLiao, JMcLaughlin, MDean, TSly, WSMay, JA 2H-Thieno[3,2-e]- and [2,3-e]-1,2-thiazine-6-sulfonamide 1,1-dioxides as ocular hypotensive agents: synthesis, carbonic anhydrase inhibition and evaluation in the rabbit. Bioorg Med Chem8:957-75 (2000) 
 
Carbonic anhydrase 2
Name:Carbonic anhydrase 2
Type:Enzyme
Mol. Mass.:29250.71
Organism:Homo sapiens (Human)
Description:P00918
Residue:260
BDBM11404
BDBM11402
NameBDBM11404
Synonyms:2H-Thieno[3,2-e]-1,2-thiazine-6-sulfonamide 1,1-dioxide 7 3-{[(2-methoxyethyl)(3-methoxypropyl)amino]methyl}-2-methyl-2H-thieno[3,2-e]-1,2-thiazine-6-sulfonamide 1,1-dioxide hydrochloride | Compound 17a3
TypeSmall organic molecule
Emp. Form.C15H25N3O6S3
Mol. Mass.439.571
SMILESCOCCCN(CCOC)CC1=Cc2cc(sc2S(=O)(=O)N1C)S(N)(=O)=O