Reaction Details
TargetCarbonic anhydrase 4
LigandBDBM11427
Substrate/CompetitorBDBM10856
Meas. Tech.CA Inhibition Assay
IC50 5.6±n/a nM
Citation Chen, HHGross, SLiao, JMcLaughlin, MDean, TSly, WSMay, JA 2H-Thieno[3,2-e]- and [2,3-e]-1,2-thiazine-6-sulfonamide 1,1-dioxides as ocular hypotensive agents: synthesis, carbonic anhydrase inhibition and evaluation in the rabbit. Bioorg Med Chem8:957-75 (2000) 
 
Carbonic anhydrase 4
Name:Carbonic anhydrase 4
Type:Enzyme
Mol. Mass.:35037.98
Organism:Homo sapiens (Human)
Description:P22748
Residue:312
BDBM11427
BDBM10856
NameBDBM11427
Synonyms:2-N-(4-methylbenzene)-1,3,4-thiadiazole-2,5-disulfonamido CHEMBL108380 | Methylbenzolamide
TypeSmall organic molecule
Emp. Form.C9H10N4O4S3
Mol. Mass.334.395
SMILESCc1ccc(cc1)S(=O)(=O)Nc1nnc(s1)S(N)(=O)=O