Reaction Details
TargetRho-associated protein kinase 1
LigandBDBM322154
Substrate/Competitorn/a
Meas. Tech.ROCK1 and ROCK2 Compound Selectivity
Ki 260±n/a nM
Citation Poyurovsky, MKim, JLiu, KZanin-Zhorov, A Rho kinase inhibitors US Patent US10183931 Publication Date 1/22/2019
 
Rho-associated protein kinase 1
Name:Rho-associated protein kinase 1
Type:Serine/threonine-protein kinase
Mol. Mass.:158156.77
Organism:Homo sapiens (Human)
Description:Q13464
Residue:1354
BDBM322154
NameBDBM322154
Synonyms:2-(3-(4-((1H-indazol-5-yl)amino)-5-methylpyrimidin-2-yl)phenoxy)-N-(piperidin-4-yl)acetamide hydrochloride US10696660, Example 28 US9815820, ex. 28
TypeSmall organic molecule
Emp. Form.C25H27N7O2
Mol. Mass.457.5276
SMILESCc1cnc(nc1Nc1ccc2[nH]ncc2c1)-c1cccc(OCC(=O)NC2CCNCC2)c1