Reaction Details
TargetSodium channel protein type 9 subunit alpha
LigandBDBM50024132
Substrate/Competitorn/a
Meas. Tech.Electrophysiological Assay
IC50 50.7±n/a nM
Citation Sun, SZenova, AYChafeev, MJia, QZhang, ZOballa, RM Benzenesulfonamide compounds and their use as therapeutic agents US Patent US9630929 Publication Date 4/25/2017
 
Sodium channel protein type 9 subunit alpha
Name:Sodium channel protein type 9 subunit alpha
Type:Protein
Mol. Mass.:226375.97
Organism:Homo sapiens (Human)
Description:Q15858
Residue:1988
BDBM50024132
NameBDBM50024132
Synonyms:CHEMBL3325530 | US9630929, Example 47
TypeSmall organic molecule
Emp. Form.C20H18F4N4O3S2
Mol. Mass.502.506
SMILESFc1ccc(cc1)C1CCNCC1(F)COc1cc(F)c(cc1F)S(=O)(=O)Nc1ncns1