Reaction Details
TargetSodium channel protein type 9 subunit alpha
LigandBDBM323121
Substrate/Competitorn/a
Meas. Tech.Electrophysiological Assay
IC50 0.900±n/a nM
Citation Sun, SZenova, AYChafeev, MJia, QZhang, ZOballa, RM Benzenesulfonamide compounds and their use as therapeutic agents US Patent US9630929 Publication Date 4/25/2017
 
Sodium channel protein type 9 subunit alpha
Name:Sodium channel protein type 9 subunit alpha
Type:Protein
Mol. Mass.:226375.97
Organism:Homo sapiens (Human)
Description:Q15858
Residue:1988
BDBM323121
NameBDBM323121
Synonyms:4-((trans-4-(4-chloro-3-fluorophenyl(piperidin-3-yl)methoxy)-2,5-difluoro-N-(1,2,4-thiadiazol-5-yl)benzenesulfonamide | US9630929, Example 97
TypeSmall organic molecule
Emp. Form.C20H18ClF3N4O3S2
Mol. Mass.518.96
SMILESFc1cc(ccc1Cl)C1CCNC[C@H]1COc1cc(F)c(cc1F)S(=O)(=O)Nc1ncns1