Reaction Details
TargetNuclear receptor ROR-gamma
LigandBDBM189873
Substrate/Competitorn/a
Meas. Tech.Assay of Co-Activator Recruitment by TR-FRET
pH7.5±n/a
Temperature298.15±n/a K
IC50 4.00±n/a nM
Commentsextracted
Citation Wennerstål, GMZamaratski, E Methyl- and trifluoromethyl-substituted pyrrolopyridine modulators of RORC2 and methods of use thereof US Patent US9670201 Publication Date 6/6/2017
 
Nuclear receptor ROR-gamma
Name:Nuclear receptor ROR-gamma
Type:Enzyme Catalytic Domain
Mol. Mass.:58218.40
Organism:Homo sapiens (Human)
Description:P51449
Residue:518
BDBM189873
NameBDBM189873
Synonyms:US10227346, Example 2 US9670201, 2 3-cyano-N-(3-(1-(cyclopentanecarbonyl)piperidin-4-yl)-1-methyl-4-(trifluoromethyl)-1H-pyrrolo[2,3-b]pyridin-5-yl)-4-methylbenzamide | US9920054, Example 2
TypeSmall organic molecule
Emp. Form.C29H30F3N5O2
Mol. Mass.537.576
SMILESCc1ccc(cc1C#N)C(=O)Nc1cnc2n(C)cc(C3CCN(CC3)C(=O)C3CCCC3)c2c1C(F)(F)F