Reaction Details
TargetNuclear receptor ROR-gamma
LigandBDBM189891
Substrate/Competitorn/a
Meas. Tech.Assay of Co-Activator Recruitment by TR-FRET
pH7.5±n/a
Temperature298.15±n/a K
IC50 3.80±n/a nM
Commentsextracted
Citation Wennerstål, GMZamaratski, E Methyl- and trifluoromethyl-substituted pyrrolopyridine modulators of RORC2 and methods of use thereof US Patent US9670201 Publication Date 6/6/2017
 
Nuclear receptor ROR-gamma
Name:Nuclear receptor ROR-gamma
Type:Enzyme Catalytic Domain
Mol. Mass.:58218.40
Organism:Homo sapiens (Human)
Description:P51449
Residue:518
BDBM189891
NameBDBM189891
Synonyms:US10227346, Example 18 US9670201, 18 3-cyano-N-(3-(1-(2-cyclobutylacetyl)piperidin-4-yl)-1-methyl-4-(trifluoromethyl)-1H-pyrrolo[2,3-b]pyridin-5-yl)benzamide | US9920054, Example 18
TypeSmall organic molecule
Emp. Form.C28H28F3N5O2
Mol. Mass.523.5494
SMILESCn1cc(C2CCN(CC2)C(=O)CC2CCC2)c2c(c(NC(=O)c3cccc(c3)C#N)cnc12)C(F)(F)F