Reaction Details
TargetSerine/threonine-protein kinase ATR
LigandBDBM323397
Substrate/Competitorn/a
Meas. Tech.Inhibition Assay
Ki<5±n/a nM
Citation Charrier, JBinch, HMHurley, DJCleveland, TJoshi, PFanning, LTPinder, JO Donnell, MNizarali Virani, AKnegtel, RMDurrant, SJYoung, SCStorck, PKay, DReaper, PMGrote, MP Compounds useful as inhibitors of ATR kinase US Patent US9630956 Publication Date 4/25/2017
 
Serine/threonine-protein kinase ATR
Name:Serine/threonine-protein kinase ATR
Type:Protein
Mol. Mass.:301404.58
Organism:Homo sapiens (Human)
Description:Q13535
Residue:2644
BDBM323397
NameBDBM323397
Synonyms:US9630956, Compound I-134
TypeSmall organic molecule
Emp. Form.C26H27N7O2
Mol. Mass.469.5383
SMILESCCC(CC)(C#N)n1cc(ccc1=O)-c1cnc(N)c(n1)-c1cc(no1)-c1ccc(CNC)cc1